NO,����,����_�J�i,�Z��,����,�ܓx,�o�x,�W��,�d�b�ԍ�,�����ԍ�,�s�撬���R�[�h,�s���{����,�s�撬����,�ЊQ���_�^��,�ЊQ���_�R����A�y�Η��y�ђn����,�ЊQ���_����,�ЊQ���_�n�k,�ЊQ���_�Ôg,�ЊQ���_��K�͂ȉΎ�,�ЊQ���_�����×�,�ЊQ���_�ΎR����,�w����Ƃ̏d��,�z����e�l��,�ΏۂƂȂ钬��E������,URL,���l
1,���ꎩ�R�ق������,�N���^�L�V�[���J���Z�C����,���m���썑�s����Q�S�R,,33.66183473,133.6093359,,,,392049,���m��,�썑�s,1,,,1,1,,,,,,,,
2,�ޘH���w�Z,�i���V���E�K�b�R�E,���m���썑�s�ޘH�V�Q�P,,33.63487849,133.6110034,,,,392049,���m��,�썑�s,1,,,1,1,,,,,,,,
3,���ؒJ���w�Z,�V���L�_�j�V���E�K�b�R�E,���m���썑�s���ؒJ�V�U�P,,33.61734705,133.5965872,,,,392049,���m��,�썑�s,1,,,1,1,,,,,,,,
4,�����΂ȗc�t��,�^�`�o�i���E�`�G��,���m���썑�s����T�V�|�R,,33.62100611,133.6388087,,,,392049,���m��,�썑�s,1,,,1,1,,,,,,,,
5,�v��c���w�Z,�N���_�V���E�K�b�R�E,���m���썑�s�v��c�T�R�Q,,33.61258686,133.6543073,,,,392049,���m��,�썑�s,1,1,,1,1,,,,,,,,
6,�v��c�ۈ珊,�N���_�z�C�N�V��,���m���썑�s�v��c�X�O�V,,33.61233964,133.6551416,,,,392049,���m��,�썑�s,1,1,,1,1,,,,,,,,
7,���{���w�Z,�R�N�u�V���E�K�b�R�E,���m���썑�s�����P�Q�O�P�|�P,,33.60092119,133.6471995,,,,392049,���m��,�썑�s,1,1,,1,1,,,,,,,,
8,���{�ۈ珊,�R�N�u�z�C�N�V��,���m���썑�s�����P�P�R�Q,,33.60003586,133.6455273,,,,392049,���m��,�썑�s,1,1,,1,1,,,,,,,,
9,�k�˒��w�Z,�z�N�����E�`���E�K�b�R�E,���m���썑�s���L���}�m��W�S�W�|�P,,33.60092119,133.6471995,,,,392049,���m��,�썑�s,1,,,1,1,,,,,,,,
10,���L���w�Z,�I�R�E�V���E�K�b�R�E,���m���썑�s���L�������X�O�R,,33.60003586,133.6455273,,,,392049,���m��,�썑�s,1,1,,1,1,,,,,,,,
11,���L�ۈ珊,�I�R�E�z�C�N�V��,���m���썑�s���L�������X�Q�Q�|�P,,33.59195342,133.6282073,,,,392049,���m��,�썑�s,,1,,1,1,,,,,,,,
12,���L�����w�Z,�I�R�E�R�E�g�E�K�b�R�E,���m���썑�s���L�������T�P�P�|�P,,33.57831264,133.6139439,,,,392049,���m��,�썑�s,1,1,,1,1,,,,,,,,
13,���������ۈ牀,�i�K�I�J�g�E�u�z�C�N�G��,���m���썑�s�������Q�R�R,,33.59019457,133.6543354,,,,392049,���m��,�썑�s,1,1,,1,1,,,,,,,,
14,�������w�Z,�i�K�I�J�V���E�K�b�R�E,���m���썑�s�������X�V,,33.58731402,133.6547682,,,,392049,���m��,�썑�s,1,1,,1,1,,,,,,,,
15,�΃��r���w�Z,�g�r�K�C�P�`���E�K�b�R�E,���m���썑�s����T�R�O,,33.58219003,133.6532196,,,,392049,���m��,�썑�s,1,1,,1,1,,,,,,,,
16,���������ۈ珊,�i�K�I�J�Z�C�u�z�C�N�V��,���m���썑�s�K���P�|�Q�|�Q�R,,33.57704597,133.6427071,,,,392049,���m��,�썑�s,1,1,,1,1,,,,,,,,
17,���m�_�ƍ����w�Z,�R�E�`�m�E�M���E�R�E�g�E�K�b�R�E,���m���썑�s����X�T�V�|�P,,33.57742072,133.6536268,,,,392049,���m��,�썑�s,1,1,,1,1,,,,,,,,
18,��Ɩ�c���w�Z,�S�����m�_�V���E�K�b�R�E,���m���썑�s����c�Q�V�U�|�Q,,33.57460178,133.6535415,,,,392049,���m��,�썑�s,1,1,,1,1,,,,,,,,
19,��c������,�m�_�R�E�~���J��,���m���썑�s����c�Q�U�V�|�P,,33.57490891,133.6550583,,,,392049,���m��,�썑�s,1,1,,1,1,,,,,,,,
20,��Ɩ�c�ۈ牀,�S�����m�_�z�C�N�G��,���m���썑�s����c���Q�|�T�|�P�W,,33.57329156,133.6519436,,,,392049,���m��,�썑�s,,1,,1,1,,,,,,,,
21,����w�Z,�I�I�V�m�V���E�K�b�R�E,���m���썑�s�����b�Q�O�V�R,,33.56767342,133.6460976,,,,392049,���m��,�썑�s,1,1,,1,1,,,,,,,,
22,�������,�I�I�V�m�R�E�~���J��,���m���썑�s�����b�Q�P�P�V,,33.56624634,133.6444141,,,,392049,���m��,�썑�s,,1,,1,1,,,,,,,,
23,��ۈ牀,�I�I�V�m�z�C�N�G��,���m���썑�s�����b�Q�T�O�S,,33.56554386,133.6424168,,,,392049,���m��,�썑�s,,1,,1,1,,,,,,,,
24,���m���H�ƍ����w�Z,�R�E�`�q�K�V�R�E�M���E�R�E�g�E�K�b�R�E,���m���썑�s���P�T�X�O,,33.57040547,133.6408148,,,,392049,���m��,�썑�s,1,1,,1,1,,,,,,,,
25,�����ۈ珊,�~���E�P���z�C�N�V��,���m���썑�s�����V�U�S�|�P,,33.56507576,133.6300648,,,,392049,���m��,�썑�s,,1,,1,1,,,,,,,,
26,�������w�Z,�J�`���E�`���E�K�b�R�E,���m���썑�s�������Q�O�R�W,,33.55561379,133.64607,,,,392049,���m��,�썑�s,1,1,,1,1,,,,,,,,
27,�⑺�ӂꂠ���Z���^�[,�C�������t���A�C�Z���^�[,���m���썑�s���D�R�V�P�|�S,,33.57914264,133.6779106,,,,392049,���m��,�썑�s,,1,,1,1,,,,,,,,
28,���쒆�w�Z,�R�E�i���`���E�K�b�R�E,���m���썑�s���c�R�Q�S,,33.56946257,133.6730002,,,,392049,���m��,�썑�s,1,1,,1,1,,,,,,,,
29,���͏��w�Z,�j�b�V���E�V���E�K�b�R�E,���m���썑�s�c�����Q�Q�U�V�|�P,,33.56157951,133.6696526,,,,392049,���m��,�썑�s,1,1,,1,1,,,,,,,,
30,���͕����𗬃Z���^�[,�j�b�V���E�t�N�V�R�E�����E�Z���^�[,���m���썑�s�c�����Q�Q�O�V,,33.56126218,133.6682818,,,,392049,���m��,�썑�s,,1,,1,1,,,,,,,,
31,�����ڂ̕ۈ珊,�A�P�{�m�z�C�N�V��,���m���썑�s�c�����Q�Q�R�P�|�Q,,33.56055937,133.6710712,,,,392049,���m��,�썑�s,,1,,1,1,,,,,,,,
32,�O�l�h�ЃR�~���j�e�B�[�Z���^�[�@,�}�G�n�}�{�E�T�C�R�~���j�e�B�[�Z���^�[,���m���썑�s�O�l�P�T�R�S�|�P,,33.53763198,133.6652393,,,,392049,���m��,�썑�s,1,1,,,,,,,,,,,
33,�喩���w�Z,�I�I�~�i�g�V���E�K�b�R�E,���m���썑�s�O�l�P�U�P�S�|�P,,33.53816805,133.6684089,,,,392049,���m��,�썑�s,,1,,,,,,,,,,,
34,�썑�s���X�|�[�c�Z���^�[,�i���R�N�V���c�X�|�[�c�Z���^�[,���m���썑�s�O�l�P�R�S�S�|�R,,33.53711182,133.6573671,,,,392049,���m��,�썑�s,1,1,,,,,,,,,,,
35,�O�a�h�ЃR�~���j�e�B�[�Z���^�[,�~���{�E�T�C�R�~���j�e�B�[�Z���^�[,���m���썑�s�����c236�Ԓn,,33.53782523,133.6655268,,,,392049,���m��,�썑�s,1,1,,,,,,,,,,,
36,�O�a�e���̍L��,�~���C�R�C�m�q���o,���m���썑�s�ЎR�P�O�O�S,,33.55250201,133.6432205,,,,392049,���m��,�썑�s,1,1,,1,1,,,,,,,,
37,���ۈ珊,�T�g�z�C�N�V��,���m���썑�s�����c�P�O�Q�U,,33.54367796,133.6439531,,,,392049,���m��,�썑�s,,1,,,,,,,,,,,
38,�O�a���w�Z,�~���V���E�K�b�R�E,���m���썑�s�����c�P�W�S�S�|�P,,33.53930016,133.6478839,,,,392049,���m��,�썑�s,,1,,,,,,,,,,,
39,�Օ��_��,�R�g�q���W���W��,���m���썑�s�����c�Q�U�O�V,,33.53282718,133.640214,,,,392049,���m��,�썑�s,,,,1,1,,,,,,,,
40,�\�s���w�Z,�g�I�`�V���E�K�b�R�E,���m���썑�s�΃��u�P�|�Q�O�O�P,,33.5288367,133.6162402,,,,392049,���m��,�썑�s,1,1,,1,1,,,,,,,,
41,�я����,�L���W���E�R�E�G��,���m���썑�s�΃��u�Q�|�Q�S�O�P�|�P,,33.533482,133.608305,,,,392049,���m��,�썑�s,,,,1,1,,,,,,,,
42,�T�t��,�[���W�u�W,���m���썑�s�\�s�R�O�W�S,,33.52350176,133.6139607,,,,392049,���m��,�썑�s,,,,1,1,,,,,,,,
43,�i�`���m�a�@,�W�F�C�G�[�R�E�`�r���E�C��,���m���썑�s�����T�Q�U�|�P,,33.56997,133.623193,,,,392049,���m��,�썑�s,,,,1,1,,,,,,,,
44,�P�A�n�E�X���R��,�P�A�n�E�X�n�N�U���\�E,���m���썑�s�1303-1,,33.545124,133.612233,,,,392049,���m��,�썑�s,,,,1,1,,,,,,,,
45,���m��`���q�^�[�~�i���r��,�R�E�`�N�E�R�E�����L���N�^�[�~�i���r��,���m���썑�s�v�}��58�Ԓn,,33.547476,133.674161,,,,392049,���m��,�썑�s,,,,1,1,,,,,,,,
46,���m��w�_�ъC�m�Ȋw��,�R�E�`�_�C�K�N�m�E�����J�C���E�J�K�N�u,���m���썑�s������200��,,33.55318294,133.677937,,,,392049,���m��,�썑�s,,,,1,1,,,,,,,,
47,���m�H�ƍ������w�Z,�R�E�`�R�E�M���E�R�E�g�E�Z�������K�b�R�E,���m���썑�s������200�ԂP,,33.547583,133.68046,,,,392049,���m��,�썑�s,,,,1,1,,,,,,,,
48,���L�����w�Z,�I�R�E�R�E�g�E�K�b�R�E,���m���썑�s���L������511-1,,33.57831264,133.6139439,,,,392049,���m��,�썑�s,,,,1,1,,,,,,,,
49,�Ôg���{�݁@�\�s���˃^���[,�c�i�~�q�i���V�Z�c�@�g�I�`�A�R�^���[,���m���썑�s�\�s4393�Ԓn3,,33.51978145,133.6088106,,,,392049,���m��,�썑�s,,,,1,1,,,,,,,,
50,�Ôg���{�݁@�\�s�ؒr�^���[,�c�i�~�q�i���V�Z�c�@�g�I�`�c�{�C�P�^���[,���m���썑�s�\�s1660�Ԓn4,,33.52514323,133.6300933,,,,392049,���m��,�썑�s,,,,1,1,,,,,,,,
51,�Ôg���{�݁@�l���c�l�c�^���[,�c�i�~�q�i���V�Z�c�@�n�}�J�C�_�n�}�_�^���[,���m���썑�s�l���c840�Ԓn4,,33.5266934,133.6390476,,,,392049,���m��,�썑�s,,,,1,1,,,,,,,,
52,�Ôg���{�݁@�l���c���^���[,�c�i�~�q�i���V�Z�c�@�n�}�J�C�_�C���T�J�^���[,���m���썑�s�l���c673�Ԓn3,,33.52839907,133.6466679,,,,392049,���m��,�썑�s,,,,1,1,,,,,,,,
53,�Ôg���{�݁@�l���c�{���^���[,�c�i�~�q�i���V�Z�c�@�n�}�J�C�_�z�������^���[,���m���썑�s�l���c2257�Ԓn50,,33.52834622,133.6499293,,,,392049,���m��,�썑�s,,,,1,1,,,,,,,,
54,�Ôg���{�݁@�l���c���m���^���[,�c�i�~�q�i���V�Z�c�@�n�}�J�C�_�i�J�m�`���E�^���[,���m���썑�s�l���c300�Ԓn2,,33.53003234,133.6566855,,,,392049,���m��,�썑�s,,,,1,1,,,,,,,,
55,�Ôg���{�݁@�O�l�ɓs���^���[,�c�i�~�q�i���V�Z�c�@�}�G�n�}�C�c�^�^���[,���m���썑�s�O�l414�Ԓn4,,33.53115172,133.6624222,,,,392049,���m��,�썑�s,,,,1,1,,,,,,,,
56,�Ôg���{�݁@�O�l�v�ۃ^���[,�c�i�~�q�i���V�Z�c�@�}�G�n�}�N�{�^���[,���m���썑�s�O�l585�Ԓn,,33.53259766,133.6674957,,,,392049,���m��,�썑�s,,,,1,1,,,,,,,,
57,�Ôg���{�݁@�O�l�l�E�^���[,�c�i�~�q�i���V�Z�c�@�}�G�n�}�n�}�N�{�^���[,���m���썑�s�O�l12�Ԓn2,,33.53102431,133.6694748,,,,392049,���m��,�썑�s,,,,1,1,,,,,,,,
58,�Ôg���{�݁@�����l�^���[,�c�i�~�q�i���V�Z�c�@�V���W�}�n�}�^���[,���m���썑�s����112�Ԓn,,33.53095696,133.6733786,,,,392049,���m��,�썑�s,,,,1,1,,,,,,,,
59,�Ôg���{�݁@�v�}��^���[,�c�i�~�q�i���V�Z�c�@�q�T�G�_�~�i�~�^���[,���m���썑�s�v�}66�Ԓn8,,33.53104574,133.6796985,,,,392049,���m��,�썑�s,,,,1,1,,,,,,,,
60,�Ôg���{�݁@�v�}�k�^���[,�c�i�~�q�i���V�Z�c�@�q�T�G�_�L�^�^���[,���m���썑�s�v�}��416�Ԓn,,33.53708826,133.6734176,,,,392049,���m��,�썑�s,,,,1,1,,,,,,,,
61,�Ôg���{�݁@�喩����^���[,�c�i�~�q�i���V�Z�c�@�I�I�~�i�g�V���E�~�i�~�^���[,���m���썑�s�O�l1577�Ԓn1,,33.5370745,133.6683561,,,,392049,���m��,�썑�s,,,,1,1,,,,,,,,
62,�Ôg���{�݁@���c���^���[,�c�i�~�q�i���V�Z�c�@�V���^�����^���[,���m���썑�s�O�l2217�Ԓn1,,33.54248917,133.6646782,,,,392049,���m��,�썑�s,,,,1,1,,,,,,,,
63,�������ꏊ,�~���E�P���q�i���o�V��,���m���썑�s���������ِ�,,,,,,,392049,���m��,�썑�s,,,,1,1,,,,,,,,
64,���m�썑���H���ꏊ�P,�R�E�`�i���R�N�h�E���q�i���o�V���P,���m���썑�s���m�{�t��,,,,,,,392049,���m��,�썑�s,,,,1,1,,,,,,,,
65,���m�썑���H���ꏊ�Q,�R�E�`�i���R�N�h�E���q�i���o�V���Q,���m���썑�s�k�g�t��,,,,,,,392049,���m��,�썑�s,,,,1,1,,,,,,,,
66,���m�썑���H���ꏊ�R,�R�E�`�i���R�N�h�E���q�i���o�V���R,���m���썑�s�k�g�t��,,,,,,,392049,���m��,�썑�s,,,,1,1,,,,,,,,
67,���m�썑���H���ꏊ�S,�R�E�`�i���R�N�h�E���q�i���o�V���S,���m���썑�s�k�g�t��,,,,,,,392049,���m��,�썑�s,,,,1,1,,,,,,,,
68,���m�썑���H���ꏊ�T,�R�E�`�i���R�N�h�E���q�i���o�V���T,���m���썑�s���q�t��,,,,,,,392049,���m��,�썑�s,,,,1,1,,,,,,,,
69,�ЎR���ꏊ,�J�^���}�q�i���o�V��,���m���썑�s����R����,,,,,,,392049,���m��,�썑�s,,,,1,1,,,,,,,,
70,�����Δ��ꏊ,�q�K�V�^�e�C�V�q�i���o�V��,���m���썑�s��v���k�̎R,,,,,,,392049,���m��,�썑�s,,,,1,1,,,,,,,,
71,�����c�E���Δ��ꏊ,�T�g�J�C�_�E�^�e�C�V�q�i���o�V��,���m���썑�s�����n,,,,,,,392049,���m��,�썑�s,,,,1,1,,,,,,,,
72,�����c���ꏊ,�T�g�J�C�_�q�i���o�V��,���m���썑�s�Օ��_��,,,,,,,392049,���m��,�썑�s,,,,1,1,,,,,,,,
73,����Δ��ꏊ,�C�i�u�^�e�C�V�q�i���o�V��,���m���썑�s�牮��|���v��k�R��,,,,,,,392049,���m��,�썑�s,,,,1,1,,,,,,,,
74,�ێR���ꏊ1,�}�����}�q�i���o�V���P,���m���썑�s�}�m���g���l����l�㕔,,,,,,,392049,���m��,�썑�s,,,,1,1,,,,,,,,
75,�ێR���ꏊ2,�}�����}�q�i���o�V���Q,���m���썑�s��m�{,,,,,,,392049,���m��,�썑�s,,,,1,1,,,,,,,,
76,�ߊ}���ꏊ1,�L�k�K�T�q�i���o�V���P,���m���썑�s������n,,,,,,,392049,���m��,�썑�s,,,,1,1,,,,,,,,
77,�ߊ}���ꏊ2,�L�k�K�T�q�i���o�V���Q,���m���썑�s��א_��,,,,,,,392049,���m��,�썑�s,,,,1,1,,,,,,,,
78,�k�n���ꏊ�P,�L�^�W�q�i���o�V���P,���m���썑�s�c���ΊD�~�n��,,,,,,,392049,���m��,�썑�s,,,,1,1,,,,,,,,
79,�k�n���ꏊ�Q,�L�^�W�q�i���o�V���Q,���m���썑�s����ΊD�~�n��,,,,,,,392049,���m��,�썑�s,,,,1,1,,,,,,,,
80,�ԓc���ꏊ�P,�n�U�}�_�q�i���o�V���P,���m���썑�s�R���c�n��,,,,,,,392049,���m��,�썑�s,,,,1,1,,,,,,,,
81,�ԓc���ꏊ�Q,�n�U�}�_�q�i���o�V���Q,���m���썑�s�ԓc�����ٓ�,,,,,,,392049,���m��,�썑�s,,,,1,1,,,,,,,,
82,�y���m�J���ꏊ�P,�h�C�m�^�j�q�i���o�V���P,���m���썑�s�Z�����쏊���ޒu��,,,,,,,392049,���m��,�썑�s,,,,1,1,,,,,,,,
83,�y���m�J���ꏊ�Q,�h�C�m�^�j�q�i���o�V���Q,���m���썑�s����w�Z�쓌,,,,,,,392049,���m��,�썑�s,,,,1,1,,,,,,,,
84,�y���m�J���ꏊ�R,�h�C�m�^�j�q�i���o�V���R,���m���썑�s����w�Z��,,,,,,,392049,���m��,�썑�s,,,,1,1,,,,,,,,
85,���J�E�y���m�J���ꏊ�P,�i�J�_�j�E�h�C�m�^�j�q�i���o�V���P,���m���썑�s���d�_��,,,,,,,392049,���m��,�썑�s,,,,1,1,,,,,,,,
86,���J�E�y���m�J���ꏊ�Q,�i�J�_�j�E�h�C�m�^�j�q�i���o�V���Q,���m���썑�s����_��,,,,,,,392049,���m��,�썑�s,,,,1,1,,,,,,,,
87,�ђJ�E���J���ꏊ,�n���V�_�j�E�i�J�_�j�q�i���o�V��,���m���썑�s�����ΊD�Ւn,,,,,,,392049,���m��,�썑�s,,,,1,1,,,,,,,,
88,���J�E�ђJ���ꏊ�P,�j�V�_�j�E�n���V�_�j�q�i���o�V���P,���m���썑�s�͔��_��,,,,,,,392049,���m��,�썑�s,,,,1,1,,,,,,,,
89,���J�E�ђJ���ꏊ�Q,�j�V�_�j�E�n���V�_�j�q�i���o�V���Q,���m���썑�s�F��_��,,,,,,,392049,���m��,�썑�s,,,,1,1,,,,,,,,
90,���v�۔��ꏊ,�R�N�{�q�i���o�V��,���m���썑�s���A�p�[�g��R��,,,,,,,392049,���m��,�썑�s,,,,1,1,,,,,,,,
91,�����J���ꏊ,�A�V�K���q�i���o�V��,���m���썑�s�����_�Г�R��,,,,,,,392049,���m��,�썑�s,,,,1,1,,,,,,,,
92,���a���ꏊ,�Z�C���q�i���o�V��,���m���썑�s���A�{��,,,,,,,392049,���m��,�썑�s,,,,1,1,,,,,,,,
93,�l�`�J���ꏊ,�j���M���E�_�j�q�i���o�V��,���m���썑�s�l�`�J�����ٖk��,,,,,,,392049,���m��,�썑�s,,,,1,1,,,,,,,,
94,���ؒr���ꏊ,�q�K�V�c�{�C�P�q�i���o�V��,���m���썑�s����y�n���ǋ搼,,,,,,,392049,���m��,�썑�s,,,,1,1,,,,,,,,
95,���ؒr���ꏊ,�j�V�c�{�C�P�q�i���o�V��,���m���썑�s���[�\�����̎R,,,,,,,392049,���m��,�썑�s,,,,1,1,,,,,,,,
96,�D����ꏊ,�t�_�o�q�i���o�V��,���m���썑�s�i�`�\�s���|�ۖk,,,,,,,392049,���m��,�썑�s,,,,1,1,,,,,,,,
97,�召�l���ꏊ,�_�C�V���E�n�}�q�i���o�V��,���m���썑�s�召�l�W��k,,,,,,,392049,���m��,�썑�s,,,,1,1,,,,,,,,
98,�����E�召�l���ꏊ,�n�b�`���E�E�_�C�V���E�n�}�q�i���o�V��,���m���썑�s�T�t��,,,,,,,392049,���m��,�썑�s,,,,1,1,,,,,,,,
99,�ێR���ꏊ,�}�����}�q�i���o�V��,���m���썑�s�Ƃ̎R����,,,,,,,392049,���m��,�썑�s,,,,1,1,,,,,,,,
